BDBM50060256 1-(9-Methyl-9-aza-bicyclo[3.3.1]non-3-yl)-3-phenyl-imidazolidin-2-one::CHEMBL112161
SMILES CN1C2CCCC1CC(C2)N1CCN(C1=O)c1ccccc1
InChI Key InChIKey=ZKFXRTQPDWLBDB-UHFFFAOYSA-N
Data  1 KI
  Tab Delimited (TSV)   2D SDfile   Computed 3D by Vconf -m prep SDfile
Find this compound or compounds like it in BindingDB:
Activity Spreadsheet -- Enzyme Inhibition Constant Data from BindingDB
Found 1 hit for monomerid = 50060256
Target5-hydroxytryptamine receptor 3A/3B(Rattus norvegicus)
Pharmacia & Upjohn
Curated by ChEMBL
LigandPNGBDBM50060256(1-(9-Methyl-9-aza-bicyclo[3.3.1]non-3-yl)-3-phenyl...)
Affinity DataKi:  190nM. Assay description: In vitro affinity for 5-hydroxytryptamine 3 (5-HT3) receptor by displacement of [3H]BRL-43694 from rat entorhinal cortex
In DepthDetails ArticlePubMed