BDBM50060297 3-(1-Methyl-4-octadecanoyl-1H-pyrrol-2-yl)-propionic acid::CHEMBL112571
SMILES CCCCCCCCCCCCCCCCCC(=O)c1cc(CCC(O)=O)n(C)c1
InChI Key InChIKey=TYCLWESNHRKZAR-UHFFFAOYSA-N
Data  1 IC50
  Tab Delimited (TSV)   2D SDfile   Computed 3D by Vconf -m prep SDfile
Find this compound or compounds like it in BindingDB:
Activity Spreadsheet -- Enzyme Inhibition Constant Data from BindingDB
Found 1 hit for monomerid = 50060297
TargetCytosolic phospholipase A2(Bos taurus)
Ludwig-Maximilians University
Curated by ChEMBL
LigandPNGBDBM50060297(3-(1-Methyl-4-octadecanoyl-1H-pyrrol-2-yl)-propion...)
Affinity DataIC50:  1.40E+4nM. Assay description: Inhibition of cPLA2 measuring Calcium ionophore A-23,187-induced arachidonic acid release from bovine platelets with HPLC/UV detection.
In DepthDetails ArticlePubMed