BDBM50060680 6-Fluoro-4-(4-methyl-piperazin-1-yl)-pyrrolo[1,2-a]quinoxaline::CHEMBL120215
SMILES CN1CCN(CC1)c1nc2c(F)cccc2n2cccc12
InChI Key InChIKey=MZVKFJCSUPSAKU-UHFFFAOYSA-N
Data  1 IC50
  Tab Delimited (TSV)   2D SDfile   Computed 3D by Vconf -m prep SDfile
Find this compound or compounds like it in BindingDB:
Activity Spreadsheet -- Enzyme Inhibition Constant Data from BindingDB
Found 1 hit for monomerid = 50060680
Target5-hydroxytryptamine receptor 3A/3B(Rattus norvegicus)
Universit£
Curated by ChEMBL
LigandPNGBDBM50060680(6-Fluoro-4-(4-methyl-piperazin-1-yl)-pyrrolo[1,2-a...)
Affinity DataIC50:  9.5nM. Assay description: Inhibition of [3H]BRL-43694 binding to 5-hydroxytryptamine 3 receptor of rat cortical homogenate.
In DepthDetails ArticlePubMed