BDBM50060689 4-(4-Ethyl-piperazin-1-yl)-pyrrolo[1,2-a]quinoxaline::CHEMBL122835
SMILES CCN1CCN(CC1)c1nc2ccccc2n2cccc12
InChI Key InChIKey=ANIMYDRBCOMVDQ-UHFFFAOYSA-N
Data  1 IC50
  Tab Delimited (TSV)   2D SDfile   Computed 3D by Vconf -m prep SDfile
Find this compound or compounds like it in BindingDB:
Activity Spreadsheet -- Enzyme Inhibition Constant Data from BindingDB
Found 1 hit for monomerid = 50060689
Target5-hydroxytryptamine receptor 3A/3B(Rattus norvegicus)
Universit£
Curated by ChEMBL
LigandPNGBDBM50060689(4-(4-Ethyl-piperazin-1-yl)-pyrrolo[1,2-a]quinoxali...)
Affinity DataIC50:  9nM. Assay description: Inhibition of [3H]BRL-43694 binding to 5-hydroxytryptamine 3 receptor of rat cortical homogenate.
In DepthDetails ArticlePubMed