BDBM50060755 ((R)-2-{(S)-2-[(6-Amino-2,4-dimethyl-pyridin-3-ylmethyl)-carbamoyl]-pyrrolidin-1-yl}-1-benzhydryl-2-oxo-ethyl)-carbamic acid tert-butyl ester::CHEMBL337923
SMILES Cc1cc(N)nc(C)c1CNC(=O)[C@@H]1CCCN1C(=O)[C@H](NC(=O)OC(C)(C)C)C(c1ccccc1)c1ccccc1
InChI Key InChIKey=WKDSOFLIZLFPJH-LITSAYRRSA-N
Data  3 KI
  Tab Delimited (TSV)   2D SDfile   Computed 3D by Vconf -m prep SDfile
Find this compound or compounds like it in BindingDB:
Activity Spreadsheet -- Enzyme Inhibition Constant Data from BindingDB
Found 3 hits for monomerid = 50060755
TargetProthrombin(Homo sapiens (Human))
Merck Research Laboratories
Curated by ChEMBL
LigandPNGBDBM50060755(((R)-2-{(S)-2-[(6-Amino-2,4-dimethyl-pyridin-3-ylm...)
Affinity DataKi:  3.60nM. Assay description: In vitro inhibitory activity against human thrombin(IIa)
In DepthDetails ArticlePubMed
TargetSerine protease 1(Bos taurus (bovine))
Merck Research Laboratories
Curated by ChEMBL
LigandPNGBDBM50060755(((R)-2-{(S)-2-[(6-Amino-2,4-dimethyl-pyridin-3-ylm...)
Affinity DataKi:  2.50E+3nM. Assay description: In vitro inhibitory activity against bovine trypsin
In DepthDetails ArticlePubMed
TargetCoagulation factor X(Homo sapiens (Human))
Merck Research Laboratories
Curated by ChEMBL
LigandPNGBDBM50060755(((R)-2-{(S)-2-[(6-Amino-2,4-dimethyl-pyridin-3-ylm...)
Affinity DataKi:  1.60E+5nM. Assay description: In vitro inhibitory activity against Coagulation factor X
In DepthDetails ArticlePubMed