BDBM50060901 1,8-Dihydroxy-2-propionyl-10H-anthracen-9-one::CHEMBL126057
SMILES CCC(=O)c1ccc2Cc3cccc(O)c3C(=O)c2c1O
InChI Key InChIKey=KGAHUIIBPUKUER-UHFFFAOYSA-N
Data  1 IC50
  Tab Delimited (TSV)   2D SDfile   Computed 3D by Vconf -m prep SDfile
Find this compound or compounds like it in BindingDB:
Activity Spreadsheet -- Enzyme Inhibition Constant Data from BindingDB
Found 1 hit for monomerid = 50060901
Target5-lipoxygenase(Bos taurus)
WestfäLische Wilhelms-UniversitäT MüNster
Curated by ChEMBL
LigandPNGBDBM50060901(1,8-Dihydroxy-2-propionyl-10H-anthracen-9-one | CH...)
Affinity DataIC50:  6.00E+3nM. Assay description: 5-LO inhibitory activity was determined by inhibition of LTB4 biosynthesis in bovine polymorphonuclear leukocytes (PMNL)
In DepthDetails ArticlePubMed