BDBM50061006 CHEMBL3393529
SMILES CCCCNc1cc(ccn1)N1CC[C@H](C1)NC
InChI Key InChIKey=LXTSAPHWFHGYGW-GFCCVEGCSA-N
Data  1 KI  1 EC50
  Tab Delimited (TSV)   2D SDfile   Computed 3D by Vconf -m prep SDfile
Find this compound or compounds like it in BindingDB:
Activity Spreadsheet -- Enzyme Inhibition Constant Data from BindingDB
Found 2 hits for monomerid = 50061006
TargetHistamine H4 receptor(Homo sapiens (Human))
Janssen Research And Development
Curated by ChEMBL
LigandPNGBDBM50061006(CHEMBL3393529)
Affinity DataKi:  7nM. Assay description: Displacement of [3H]histamine from human recombinant histamine H4 receptor
In DepthDetails ArticlePubMed
TargetHistamine H4 receptor(Homo sapiens (Human))
Janssen Research And Development
Curated by ChEMBL
LigandPNGBDBM50061006(CHEMBL3393529)
Affinity DataEC50:  48nM. Assay description: Agonist activity at human recombinant histamine H4 receptor expressed in SK-N-MC cells assessed as effect on forskolin-stimulated cAMP-mediated repor...
In DepthDetails ArticlePubMed