BDBM50061013 CHEMBL3393551
SMILES CN[C@H]1CCN(C1)c1cnnc(NCC(C)C)c1
InChI Key InChIKey=UDERFTNWMWSEFW-NSHDSACASA-N
Data  1 KI
  Tab Delimited (TSV)   2D SDfile   Computed 3D by Vconf -m prep SDfile
Find this compound or compounds like it in BindingDB:
Activity Spreadsheet -- Enzyme Inhibition Constant Data from BindingDB
Found 1 hit for monomerid = 50061013
TargetHistamine H4 receptor(Homo sapiens (Human))
Janssen Research And Development
Curated by ChEMBL
LigandPNGBDBM50061013(CHEMBL3393551)
Affinity DataKi:  389nM. Assay description: Displacement of [3H]histamine from human recombinant histamine H4 receptor
In DepthDetails ArticlePubMed