BDBM50061189 (10R,13S)-10,13-Dimethyl-17-(2H-pyrazol-3-yl)-2,3,4,7,8,9,10,11,12,13,14,15,16,17-tetradecahydro-1H-cyclopenta[a]phenanthren-3-ol::CHEMBL115944
SMILES C[C@]12CCC3C(CC=C4CC(O)CC[C@]34C)C1CCC2c1ccn[nH]1
InChI Key InChIKey=XUSSDKMAUSOQSK-XEYOUOGVSA-N
Data  2 IC50
  Tab Delimited (TSV)   2D SDfile   Computed 3D by Vconf -m prep SDfile
Find this compound or compounds like it in BindingDB:
Activity Spreadsheet -- Enzyme Inhibition Constant Data from BindingDB
Found 2 hits for monomerid = 50061189
TargetSteroid 17-alpha-hydroxylase/17,20 lyase(Rattus norvegicus (Rat))
University Of Maryland
Curated by ChEMBL
LigandPNGBDBM50061189((10R,13S)-10,13-Dimethyl-17-(2H-pyrazol-3-yl)-2,3,...)
Affinity DataIC50:  1.50E+3nM. Assay description: Inhibition of rat testicual micrososmal Cytochrome P450 17A1
In DepthDetails ArticlePubMed
TargetSteroid 17-alpha-hydroxylase/17,20 lyase(Homo sapiens (Human))
University Of Maryland
Curated by ChEMBL
LigandPNGBDBM50061189((10R,13S)-10,13-Dimethyl-17-(2H-pyrazol-3-yl)-2,3,...)
Affinity DataIC50:  150nM. Assay description: Inhibition of human testicular microsomal Cytochrome P450 17A1
In DepthDetails ArticlePubMed