BDBM50061232 2-Amino-5-(N'-prop-2-ynyl-guanidino)-pentanoic acid::CHEMBL340224
SMILES [NH3+]C(CCCNC(=N)NCC#C)C([O-])=O
InChI Key InChIKey=IAYULXZCALADJD-UHFFFAOYSA-N
Data  3 KI
  Tab Delimited (TSV)   2D SDfile   Computed 3D by Vconf -m prep SDfile
Find this compound or compounds like it in BindingDB:
Activity Spreadsheet -- Enzyme Inhibition Constant Data from BindingDB
Found 3 hits for monomerid = 50061232
TargetNitric oxide synthase, brain(Rattus norvegicus (rat))
Northwestern University
Curated by ChEMBL
LigandPNGBDBM50061232(2-Amino-5-(N'-prop-2-ynyl-guanidino)-pentanoic aci...)
Affinity DataKi:  430nM. Assay description: Compound was tested for binding affinity against neuronal nitric oxide synthase(nNOS)
In DepthDetails ArticlePubMed
TargetNitric oxide synthase, inducible(Mus musculus (mouse))
Northwestern University
Curated by ChEMBL
LigandPNGBDBM50061232(2-Amino-5-(N'-prop-2-ynyl-guanidino)-pentanoic aci...)
Affinity DataKi:  620nM. Assay description: Compound was tested for binding affinity against recombinant inducible nitric oxide synthase (iNOS) from mouse
In DepthDetails ArticlePubMed
TargetNitric oxide synthase, endothelial(Bos taurus (bovine))
Northwestern University
Curated by ChEMBL
LigandPNGBDBM50061232(2-Amino-5-(N'-prop-2-ynyl-guanidino)-pentanoic aci...)
Affinity DataKi:  810nM. Assay description: Compound was tested for binding affinity against Endothelial nitric oxide synthase
In DepthDetails ArticlePubMed