BDBM50061318 1,2,3,4-Tetrahydro-benzo[h]isoquinolin-8-ol::1,2,3,4-tetrahydrobenzo[h]isoquinolin-8-ol::CHEMBL130744
SMILES Oc1ccc2c3CNCCc3ccc2c1
InChI Key InChIKey=MWWTWCVGHVVXBZ-UHFFFAOYSA-N
Data  3 KI
  Tab Delimited (TSV)   2D SDfile   Computed 3D by Vconf -m prep SDfile
Find this compound or compounds like it in BindingDB:
Activity Spreadsheet -- Enzyme Inhibition Constant Data from BindingDB
Found 3 hits for monomerid = 50061318
LigandPNGBDBM50061318(1,2,3,4-Tetrahydro-benzo[h]isoquinolin-8-ol | 1,2,...)
Affinity DataKi:  825nM. Assay description: Inhibition of [3H]clonidine binding to the rat alpha-2-adrenoceptor
In DepthDetails ArticlePubMed
TargetPhenylethanolamine N-methyltransferase(Bos taurus (bovine))
University Of Kansas
Curated by ChEMBL
LigandPNGBDBM50061318(1,2,3,4-Tetrahydro-benzo[h]isoquinolin-8-ol | 1,2,...)
Affinity DataKi:  980nM. Assay description: Inhibition of Phenylethanolamine N-methyltransferase (PNMT)
In DepthDetails ArticlePubMed
TargetPhenylethanolamine N-methyltransferase(Bos taurus (bovine))
University Of Kansas
Curated by ChEMBL
LigandPNGBDBM50061318(1,2,3,4-Tetrahydro-benzo[h]isoquinolin-8-ol | 1,2,...)
Affinity DataKi:  2.45E+3nM. Assay description: Inhibitory activity against bovine adrenal phenylethanolamine N-methyl-transferase (PNMT)
In DepthDetails ArticlePubMed