BDBM50061410 3-[(4R,5S,6S,7R)-3-(3-Amino-benzyl)-4,7-dibenzyl-5,6-dihydroxy-2-oxo-[1,3]diazepan-1-ylmethyl]-N-(1H-benzoimidazol-2-yl)-benzamide::CHEMBL336730
SMILES Nc1cccc(CN2[C@H](Cc3ccccc3)[C@H](O)[C@@H](O)[C@@H](Cc3ccccc3)N(Cc3cccc(c3)C(=O)Nc3nc4ccccc4[nH]3)C2=O)c1
InChI Key InChIKey=DTARGNCRAXTWIW-RNATXAOGSA-N
Data  1 KI
  Tab Delimited (TSV)   2D SDfile   Computed 3D by Vconf -m prep SDfile
Find this compound or compounds like it in BindingDB:
Activity Spreadsheet -- Enzyme Inhibition Constant Data from BindingDB
Found 1 hit for monomerid = 50061410
TargetGag-Pol polyprotein [489-587](Human immunodeficiency virus type 1)
Dupont Pharmaceuticals
Curated by ChEMBL
LigandPNGBDBM50061410(3-[(4R,5S,6S,7R)-3-(3-Amino-benzyl)-4,7-dibenzyl-5...)
Affinity DataKi:  0.0230nM. Assay description: Affinity of the compound against HIV protease
In DepthDetails ArticlePubMed