BDBM50061584 CHEMBL3394048
SMILES NC1=N[C@@]2(CO1)c1cc(ccc1Oc1cnc(cc21)N1CCC(F)(F)CC1)-c1cccnc1F
InChI Key InChIKey=USDXESLWXNWPPR-DEOSSOPVSA-N
Data  1 KI  3 IC50
  Tab Delimited (TSV)   2D SDfile   Computed 3D by Vconf -m prep SDfile
Find this compound or compounds like it in BindingDB:
Activity Spreadsheet -- Enzyme Inhibition Constant Data from BindingDB
Found 4 hits for monomerid = 50061584
TargetPotassium voltage-gated channel subfamily H member 2(Homo sapiens (Human))
Amgen
Curated by ChEMBL
LigandPNGBDBM50061584(CHEMBL3394048)
Affinity DataKi: >1.00E+4nM. Assay description: Displacement of [3H]dofetilide from human ERG expressed in HEK293 cells
In DepthDetails ArticlePubMed
TargetBeta-secretase 1(Homo sapiens (Human))
Amgen
Curated by ChEMBL
LigandPNGBDBM50061584(CHEMBL3394048)
Affinity DataIC50:  8.70nM. Assay description: Inhibition of BACE1 in HEK293T cells expressing APPswedish mutant assessed as inhibition of amyloid beta 40 production by sandwich ELISA
In DepthDetails ArticlePubMed
TargetCathepsin D(Homo sapiens (Human))
Amgen
Curated by ChEMBL
LigandPNGBDBM50061584(CHEMBL3394048)
Affinity DataIC50:  140nM. Assay description: Inhibition of cathepsin D (unknown origin)
In DepthDetails ArticlePubMed
TargetBeta-secretase 1(Homo sapiens (Human))
Amgen
Curated by ChEMBL
LigandPNGBDBM50061584(CHEMBL3394048)
Affinity DataIC50:  0.700nM. Assay description: Inhibition of BACE1 (unknown origin) by fluorescence assay
In DepthDetails ArticlePubMed