BDBM50061926 4-Isopropyl-N-[4-(3-nitro-phenyl)-thiazol-2-yl]-benzenesulfonamide::CHEMBL343947
SMILES CC(C)c1ccc(cc1)S(=O)(=O)Nc1nc(cs1)-c1cccc(c1)[N+]([O-])=O
InChI Key InChIKey=DEFQWBMGFWZHNA-UHFFFAOYSA-N
Data  1 IC50
  Tab Delimited (TSV)   2D SDfile   Computed 3D by Vconf -m prep SDfile
Find this compound or compounds like it in BindingDB:
Activity Spreadsheet -- Enzyme Inhibition Constant Data from BindingDB
Found 1 hit for monomerid = 50061926
TargetKynurenine 3-monooxygenase(Rattus norvegicus)
F. Hoffmann-La Roche
Curated by ChEMBL
LigandPNGBDBM50061926(4-Isopropyl-N-[4-(3-nitro-phenyl)-thiazol-2-yl]-be...)
Affinity DataIC50:  990nM. Assay description: Inhibition of rat kidney Kynurenine 3-hydroxylase.
In DepthDetails ArticlePubMed