BDBM50061966 CHEMBL139737::Isopropyl-[3-(naphthalen-1-yloxy)-propyl]-amine
SMILES CC(C)NCCCOc1cccc2ccccc12
InChI Key InChIKey=GWFGPUOJJHYUTD-UHFFFAOYSA-N
Data  1 KI  1 EC50
  Tab Delimited (TSV)   2D SDfile   Computed 3D by Vconf -m prep SDfile
Find this compound or compounds like it in BindingDB:
Activity Spreadsheet -- Enzyme Inhibition Constant Data from BindingDB
Found 2 hits for monomerid = 50061966
Target5-hydroxytryptamine receptor 1B(Homo sapiens (Human))
Medical College Of Virginia/Virginia Commonwealth University
Curated by ChEMBL
LigandPNGBDBM50061966(CHEMBL139737 | Isopropyl-[3-(naphthalen-1-yloxy)-p...)
Affinity DataKi:  7.66E+3nM. Assay description: Agonist activity to the human recombinant 5-hydroxytryptamine 1B receptor
In DepthDetails ArticlePubMed
TargetNuclear receptor subfamily 2 group E member 1(Homo sapiens)
Goethe-University Frankfurt
Curated by ChEMBL
LigandPNGBDBM50061966(CHEMBL139737 | Isopropyl-[3-(naphthalen-1-yloxy)-p...)
Affinity DataEC50:  5.00E+4nM. Assay description: Agonist activity at in human TLX LBD expressed in human HEK293T cells coexpressing Gal4-VP 16 assessed as increase in reporter activity measured afte...
In DepthDetails ArticlePubMed