BDBM50062000 2-[(R)-2-(Adamantan-2-yloxycarbonylamino)-3-(1H-indol-3-yl)-2-methyl-propionylamino]-cyclohexanecarboxylic acid::CHEMBL141370
SMILES C[C@](Cc1c[nH]c2ccccc12)(NC(=O)OC1C2CC3CC(C2)CC1C3)C(=O)NC1CCCCC1C(O)=O
InChI Key InChIKey=VKDPOXLXRQRSKD-FHZHWYMKSA-N
Data  2 IC50
  Tab Delimited (TSV)   2D SDfile   Computed 3D by Vconf -m prep SDfile
Find this compound or compounds like it in BindingDB:
Activity Spreadsheet -- Enzyme Inhibition Constant Data from BindingDB
Found 2 hits for monomerid = 50062000
TargetCholecystokinin receptor type A(RAT)
Warner-Lambert
Curated by ChEMBL
LigandPNGBDBM50062000(2-[(R)-2-(Adamantan-2-yloxycarbonylamino)-3-(1H-in...)
Affinity DataIC50:  701nM. Assay description: Inhibitory concentration against radioligand [125I]Bolton-Hunter labeled CCK-8 to cholecystokinin type A receptor in the rat pancreas
In DepthDetails ArticlePubMed
TargetGastrin/cholecystokinin type B receptor(MOUSE)
Warner-Lambert
Curated by ChEMBL
LigandPNGBDBM50062000(2-[(R)-2-(Adamantan-2-yloxycarbonylamino)-3-(1H-in...)
Affinity DataIC50:  0.990nM. Assay description: Inhibitory concentration against radioligand [125I]Bolton-Hunter labeled CCK-8 to cholecystokinin type B receptor in the mouse cerebral cortex
In DepthDetails ArticlePubMed