BDBM50062091 1-(2-Ethoxy-ethyl)-3-[4-(2-methyl-imidazo[4,5-c]pyridin-1-ylmethyl)-benzoyl]-1H-indole-4-carboxylic acid methyl ester::CHEMBL173586
SMILES CCOCCn1cc(C(=O)c2ccc(Cn3c(C)nc4cnccc34)cc2)c2c(cccc12)C(=O)OC
InChI Key InChIKey=ZTDQUQMLLQRMHP-UHFFFAOYSA-N
Data  1 KI
  Tab Delimited (TSV)   2D SDfile   Computed 3D by Vconf -m prep SDfile
Find this compound or compounds like it in BindingDB:
Activity Spreadsheet -- Enzyme Inhibition Constant Data from BindingDB
Found 1 hit for monomerid = 50062091
TargetPlatelet-activating factor receptor(Cavia porcellus)
Abbott Laboratories
Curated by ChEMBL
LigandPNGBDBM50062091(1-(2-Ethoxy-ethyl)-3-[4-(2-methyl-imidazo[4,5-c]py...)
Affinity DataKi:  1.10nM. Assay description: Binding potency against Platelet activating factor (PAF) receptor using [3H]-C18-PAF as radioligand on rabbit platelet membranes
In DepthDetails ArticlePubMed