BDBM50062132 6-Propyl-piperidin-(2Z)-ylideneamine::CHEMBL6760
SMILES CCCC1CCCC(N)=N1
InChI Key InChIKey=CISAVHFVACXGDG-UHFFFAOYSA-N
Data  3 IC50
  Tab Delimited (TSV)   2D SDfile   Computed 3D by Vconf -m prep SDfile
Find this compound or compounds like it in BindingDB:
Activity Spreadsheet -- Enzyme Inhibition Constant Data from BindingDB
Found 3 hits for monomerid = 50062132
TargetNitric oxide synthase, brain(Homo sapiens (Human))
G. D. Searle Research And Development
Curated by ChEMBL
LigandPNGBDBM50062132(6-Propyl-piperidin-(2Z)-ylideneamine | CHEMBL6760)
Affinity DataIC50:  500nM. Assay description: Inhibition of human Neuronal nitric oxide synthase
In DepthDetails ArticlePubMed
TargetNitric oxide synthase, endothelial(Homo sapiens (Human))
G. D. Searle Research And Development
Curated by ChEMBL
LigandPNGBDBM50062132(6-Propyl-piperidin-(2Z)-ylideneamine | CHEMBL6760)
Affinity DataIC50:  2.20E+3nM. Assay description: inhibition of human endothelial constitutive Endothelial nitric oxide synthase (heNOS)
In DepthDetails ArticlePubMed
TargetNitric oxide synthase, inducible(Homo sapiens (Human))
G. D. Searle Research And Development
Curated by ChEMBL
LigandPNGBDBM50062132(6-Propyl-piperidin-(2Z)-ylideneamine | CHEMBL6760)
Affinity DataIC50:  200nM. Assay description: Inhibition of human Inducible nitric oxide synthase
In DepthDetails ArticlePubMed