BDBM50062144 CHEMBL268294::Methyl-piperidin-(2Z)-ylidene-amine
SMILES CNC1=NCCCC1
InChI Key InChIKey=COYBWDBKVQRBJX-UHFFFAOYSA-N
Data  3 IC50
  Tab Delimited (TSV)   2D SDfile   Computed 3D by Vconf -m prep SDfile
Find this compound or compounds like it in BindingDB:
Activity Spreadsheet -- Enzyme Inhibition Constant Data from BindingDB
Found 3 hits for monomerid = 50062144
TargetNitric oxide synthase, endothelial(Homo sapiens (Human))
G. D. Searle Research And Development
Curated by ChEMBL
LigandPNGBDBM50062144(CHEMBL268294 | Methyl-piperidin-(2Z)-ylidene-amine)
Affinity DataIC50: >1.00E+5nM. Assay description: inhibition of human endothelial constitutive Endothelial nitric oxide synthase (heNOS)
In DepthDetails ArticlePubMed
TargetNitric oxide synthase, inducible(Homo sapiens (Human))
G. D. Searle Research And Development
Curated by ChEMBL
LigandPNGBDBM50062144(CHEMBL268294 | Methyl-piperidin-(2Z)-ylidene-amine)
Affinity DataIC50: >1.00E+5nM. Assay description: Inhibition of human Inducible nitric oxide synthase
In DepthDetails ArticlePubMed
TargetNitric oxide synthase, brain(Homo sapiens (Human))
G. D. Searle Research And Development
Curated by ChEMBL
LigandPNGBDBM50062144(CHEMBL268294 | Methyl-piperidin-(2Z)-ylidene-amine)
Affinity DataIC50: >1.00E+5nM. Assay description: Inhibition of human Neuronal nitric oxide synthase
In DepthDetails ArticlePubMed