BDBM50062190 CHEMBL439085::YPTNVGSEAF
SMILES CC(C)[C@H](NC(=O)[C@H](CC(N)=O)NC(=O)[C@@H](NC(=O)[C@@H]1CCCN1C(=O)[C@@H](N)Cc1ccc(O)cc1)[C@@H](C)O)C(=O)NCC(=O)N[C@@H](CO)C(=O)N[C@@H](CCC(O)=O)C(=O)N[C@@H](C)C(=O)N[C@@H](Cc1ccccc1)C(O)=O
InChI Key InChIKey=UDVWJPDPXIDQSA-KYEQORJLSA-N
Data  1 IC50
  Tab Delimited (TSV)   2D SDfile   Computed 3D by Vconf -m prep SDfile
Find this compound or compounds like it in BindingDB:
Activity Spreadsheet -- Enzyme Inhibition Constant Data from BindingDB
Found 1 hit for monomerid = 50062190
TargetCalcitonin gene-related peptide type 1 receptor(Homo sapiens (Human))
Eth ZüRich
Curated by ChEMBL
LigandPNGBDBM50062190(CHEMBL439085 | YPTNVGSEAF)
Affinity DataIC50:  2.40E+4nM. Assay description: CGRP1 receptor affinity on human neuroblastoma cells SK-N-MC, which selectively express the human CGRP1 receptor.
In DepthDetails ArticlePubMed