BDBM50062278 CHEMBL55804::Phosphoric acid mono-[2-(6-amino-purin-9-yl)-5-phosphonooxymethyl-tetrahydro-furan-3-yl] ester
SMILES Nc1ncnc2n(cnc12)C1OC(COP(O)(O)=O)CC1OP(O)(O)=O
InChI Key InChIKey=BSJXUNIJZGLCLW-UHFFFAOYSA-N
Data  1 IC50  1 EC50
  Tab Delimited (TSV)   2D SDfile   Computed 3D by Vconf -m prep SDfile
Find this compound or compounds like it in BindingDB:
Activity Spreadsheet -- Enzyme Inhibition Constant Data from BindingDB
Found 2 hits for monomerid = 50062278
TargetP2Y purinoceptor 1(Meleagris gallopavo)
National Institute Of Diabetes
Curated by ChEMBL
LigandPNGBDBM50062278(CHEMBL55804 | Phosphoric acid mono-[2-(6-amino-pur...)
Affinity DataEC50:  8.33E+3nM. Assay description: Agonist activity at P2Y1 receptor measured as capacity to stimulate 50% phospholipase C in turkey erythrocyte membranes
In DepthDetails ArticlePubMed
TargetP2Y purinoceptor 1(Meleagris gallopavo)
National Institute Of Diabetes
Curated by ChEMBL
LigandPNGBDBM50062278(CHEMBL55804 | Phosphoric acid mono-[2-(6-amino-pur...)
Affinity DataIC50:  1.10E+4nM. Assay description: Antagonist activity at P2Y1 receptor measured as capacity to inhibit 50% of phospholipase C stimulation elicited by 10 nM 2-MeSATP
In DepthDetails ArticlePubMed