BDBM50062280 CHEMBL55718::Phosphoric acid mono-[6-(6-amino-purin-9-yl)-2-hydroxy-2-oxo-tetrahydro-2lambda*5*-furo[3,4-d][1,3,2]dioxaphosphol-4-ylmethyl] ester
SMILES Nc1ncnc2n(cnc12)C1OC(COP(O)(O)=O)C2OP(O)(=O)OC12
InChI Key InChIKey=HJMBCNJTGVMDOA-UHFFFAOYSA-N
Data  1 IC50  1 EC50
PDB links: 45 PDB IDs match this monomer.
  Tab Delimited (TSV)   2D SDfile   Computed 3D by Vconf -m prep SDfile
Find this compound or compounds like it in BindingDB:
Activity Spreadsheet -- Enzyme Inhibition Constant Data from BindingDB
Found 2 hits for monomerid = 50062280
TargetP2Y purinoceptor 1(Meleagris gallopavo)
National Institute Of Diabetes
Curated by ChEMBL
LigandPNGBDBM50062280(CHEMBL55718 | Phosphoric acid mono-[6-(6-amino-pur...)
Affinity DataIC50:  1.27E+4nM. Assay description: Antagonist activity at P2Y1 receptor measured as capacity to inhibit 50% of phospholipase C stimulation elicited by 10 nM 2-MeSATP
In DepthDetails ArticlePubMed
TargetP2Y purinoceptor 1(Meleagris gallopavo)
National Institute Of Diabetes
Curated by ChEMBL
LigandPNGBDBM50062280(CHEMBL55718 | Phosphoric acid mono-[6-(6-amino-pur...)
Affinity DataEC50:  4.09E+4nM. Assay description: Agonist activity at P2Y1 receptor measured as capacity to stimulate 50% phospholipase C in turkey erythrocyte membranes
In DepthDetails ArticlePubMed