BDBM50062308 (R)-N*4*-Hydroxy-N*1*-[(S)-1-(3-imidazol-1-yl-propylcarbamoyl)-2-(1H-indol-3-yl)-ethyl]-2-isobutyl-succinamide::CHEMBL307090
SMILES CC(C)C[C@H](CC(=O)NO)C(=O)N[C@@H](Cc1c[nH]c2ccccc12)C(=O)NCCCn1ccnc1
InChI Key InChIKey=YUPQCEGDWHZIJW-GCJKJVERSA-N
Data  3 KI
  Tab Delimited (TSV)   2D SDfile   Computed 3D by Vconf -m prep SDfile
Find this compound or compounds like it in BindingDB:
Activity Spreadsheet -- Enzyme Inhibition Constant Data from BindingDB
Found 3 hits for monomerid = 50062308
TargetNeutrophil collagenase(Homo sapiens (Human))
Glycomed
Curated by ChEMBL
LigandPNGBDBM50062308((R)-N*4*-Hydroxy-N*1*-[(S)-1-(3-imidazol-1-yl-prop...)
Affinity DataKi:  0.590nM. Assay description: The compound was tested for its binding affinity towards neutrophil collagenase (Matrix metalloproteinase-8)
In DepthDetails ArticlePubMed
TargetMatrix metalloproteinase-9(Homo sapiens (Human))
Glycomed
Curated by ChEMBL
LigandPNGBDBM50062308((R)-N*4*-Hydroxy-N*1*-[(S)-1-(3-imidazol-1-yl-prop...)
Affinity DataKi:  1.10nM. Assay description: The compound was tested for its binding affinity towards 92 kDa gelatinase (Matrix metalloproteinase-9)
In DepthDetails ArticlePubMed
Target72 kDa type IV collagenase(Homo sapiens (Human))
Glycomed
Curated by ChEMBL
LigandPNGBDBM50062308((R)-N*4*-Hydroxy-N*1*-[(S)-1-(3-imidazol-1-yl-prop...)
Affinity DataKi:  1.30nM. Assay description: Binding affinity towards 72 kDa gelatinase (Matrix metalloproteinase-2)
In DepthDetails ArticlePubMed