BDBM50062478 CHEMBL116641::N-Hydroxy-2-isobutyl-N'-(3-phenyl-propyl)-malonamide::N1-hydroxy-2-isobutyl-N3-(3-phenylpropyl)malonamide
SMILES CC(C)CC(C(=O)NO)C(=O)NCCCc1ccccc1
InChI Key InChIKey=XKYMHQLYNCGEBF-UHFFFAOYSA-N
Data  2 KI  2 IC50
  Tab Delimited (TSV)   2D SDfile   Computed 3D by Vconf -m prep SDfile
Find this compound or compounds like it in BindingDB:
Activity Spreadsheet -- Enzyme Inhibition Constant Data from BindingDB
Found 4 hits for monomerid = 50062478
TargetNeutrophil collagenase(Homo sapiens (Human))
Pomona College
Curated by ChEMBL
LigandPNGBDBM50062478(CHEMBL116641 | N-Hydroxy-2-isobutyl-N'-(3-phenyl-p...)
Affinity DataKi:  537nM. Assay description: Inhibition of MMP8
In DepthDetails ArticlePubMed
TargetNeutrophil collagenase(Homo sapiens (Human))
Pomona College
Curated by ChEMBL
LigandPNGBDBM50062478(CHEMBL116641 | N-Hydroxy-2-isobutyl-N'-(3-phenyl-p...)
Affinity DataKi:  540nM. Assay description: Inhibition of Matrix metalloproteinase-8 (Human neutrophil collagenase, MMP-8)
In DepthDetails ArticlePubMed
TargetM1 family aminopeptidase(Plasmodium falciparum (isolate FcB1 / Columbia))
University Of Lille
Curated by ChEMBL
LigandPNGBDBM50062478(CHEMBL116641 | N-Hydroxy-2-isobutyl-N'-(3-phenyl-p...)
Affinity DataIC50:  790nM. Assay description: Inhibition of Plasmodium falciparum FcB1 M1 aminopeptidase
In DepthDetails ArticlePubMed
TargetAminopeptidase N(Sus scrofa (Pig))
University Of Lille 2
Curated by ChEMBL
LigandPNGBDBM50062478(CHEMBL116641 | N-Hydroxy-2-isobutyl-N'-(3-phenyl-p...)
Affinity DataIC50:  528nM. Assay description: Inhibition of microsomal neural aminopeptidase in pig kidney
In DepthDetails ArticlePubMed