BDBM50062538 (S)-2-[(R)-1-Amino-1-carboxy-3-(3-trifluoromethyl-phenyl)-propyl]-cyclopropanecarboxylic acid::CHEMBL123847
SMILES N[C@](CCc1cccc(c1)C(F)(F)F)(C1C[C@@H]1C(O)=O)C(O)=O
InChI Key InChIKey=SUBNOKFHGUEIMG-PFSRQVJMSA-N
Data  2 IC50
  Tab Delimited (TSV)   2D SDfile   Computed 3D by Vconf -m prep SDfile
Find this compound or compounds like it in BindingDB:
Activity Spreadsheet -- Enzyme Inhibition Constant Data from BindingDB
Found 2 hits for monomerid = 50062538
TargetMetabotropic glutamate receptor 2(Homo sapiens (Human))
Eli Lilly
Curated by ChEMBL
LigandPNGBDBM50062538((S)-2-[(R)-1-Amino-1-carboxy-3-(3-trifluoromethyl-...)
Affinity DataIC50:  220nM. Assay description: Effect on 1S,3R-ACPD-induced inhibition of forskolin stimulated cyclic-AMP in RGT cells expressing human Metabotropic glutamate receptor 2
In DepthDetails ArticlePubMed
TargetMetabotropic glutamate receptor 3(Homo sapiens (Human))
Eli Lilly
Curated by ChEMBL
LigandPNGBDBM50062538((S)-2-[(R)-1-Amino-1-carboxy-3-(3-trifluoromethyl-...)
Affinity DataIC50:  420nM. Assay description: Effect on 1S,3R-ACPD-induced inhibition of forskolin stimulated cyclic-AMP in RGT cells expressing human Metabotropic glutamate receptor 3
In DepthDetails ArticlePubMed