BDBM50062581 3-(4-Methylsulfanyl-[1,2,5]thiadiazol-3-yloxy)-1-aza-bicyclo[2.2.2]octane::CHEMBL125518
SMILES CSc1nsnc1OC1CN2CCC1CC2
InChI Key InChIKey=BIZYUCRYNCXWQL-UHFFFAOYSA-N
Data  2 IC50
  Tab Delimited (TSV)   2D SDfile   Computed 3D by Vconf -m prep SDfile
Find this compound or compounds like it in BindingDB:
Activity Spreadsheet -- Enzyme Inhibition Constant Data from BindingDB
Found 2 hits for monomerid = 50062581
TargetMuscarinic acetylcholine receptor M1(RAT)
Eli Lilly
Curated by ChEMBL
LigandPNGBDBM50062581(3-(4-Methylsulfanyl-[1,2,5]thiadiazol-3-yloxy)-1-a...)
Affinity DataIC50:  17.5nM. Assay description: Binding affinity for muscarinic acetylcholine receptor M1 using [3H]-oxotremorine-M (Oxo-M) radioligand in rat hippocampus membranes
In DepthDetails ArticlePubMed
TargetMuscarinic acetylcholine receptor M1(RAT)
Eli Lilly
Curated by ChEMBL
LigandPNGBDBM50062581(3-(4-Methylsulfanyl-[1,2,5]thiadiazol-3-yloxy)-1-a...)
Affinity DataIC50:  43nM. Assay description: Binding affinity for muscarinic acetylcholine receptor M1 using [3H]-Pirenzepine (Pz) radioligand in rat hippocampus membranes.
In DepthDetails ArticlePubMed