BDBM50062643 2-Chloro-5-((S)-1-pyrrolidin-2-ylmethoxy)-pyridine::CHEMBL132486
SMILES Clc1ccc(OC[C@@H]2CCCN2)cn1
InChI Key InChIKey=AVMMTWYIFAHXNS-QMMMGPOBSA-N
Data  1 EC50
  Tab Delimited (TSV)   2D SDfile   Computed 3D by Vconf -m prep SDfile
Find this compound or compounds like it in BindingDB:
Activity Spreadsheet -- Enzyme Inhibition Constant Data from BindingDB
Found 1 hit for monomerid = 50062643
TargetNeuronal acetylcholine receptor subunit alpha-3(Homo sapiens (Human))
Abbott Laboratories
Curated by ChEMBL
LigandPNGBDBM50062643(2-Chloro-5-((S)-1-pyrrolidin-2-ylmethoxy)-pyridine...)
Affinity DataEC50:  1.19E+3nM. Assay description: Functional activation of human sympathetic ganglionic type nAChRs in IMR-32 cells containing alpha-3 subtype
In DepthDetails ArticlePubMed