BDBM50062720 CHEMBL3397708
SMILES CCCC\C(=C/c1cc(ccc1OCc1ccc(cc1)C(F)(F)F)-c1ccccc1)C(O)=O
InChI Key InChIKey=PBIVKAAJQBKJKW-OQKWZONESA-N
Data  2 IC50  1 EC50
  Tab Delimited (TSV)   2D SDfile   Computed 3D by Vconf -m prep SDfile
Find this compound or compounds like it in BindingDB:
Activity Spreadsheet -- Enzyme Inhibition Constant Data from BindingDB
Found 3 hits for monomerid = 50062720
TargetPresenilin-1(Homo sapiens (Human))
Goethe-University Frankfurt
Curated by ChEMBL
LigandPNGBDBM50062720(CHEMBL3397708)
Affinity DataIC50:  1.19E+4nM. Assay description: Inhibition of wild-type human presenilin-1 stably overexpressed in CHO cells co-expressing wild-type human amyloid precursor protein assessed as inhi...
In DepthDetails ArticlePubMed
TargetPolyunsaturated fatty acid 5-lipoxygenase(Homo sapiens (Human))
Goethe-University Frankfurt
Curated by ChEMBL
LigandPNGBDBM50062720(CHEMBL3397708)
Affinity DataIC50:  5.70E+3nM. Assay description: Inhibition of 5-LO in human human PMNL assessed as reduction in 5-LO product formation pre-incubated for 15 mins before addition of arachidonic acid ...
In DepthDetails ArticlePubMed
TargetPresenilin-1(Homo sapiens (Human))
Goethe-University Frankfurt
Curated by ChEMBL
LigandPNGBDBM50062720(CHEMBL3397708)
Affinity DataEC50:  1.20E+4nM. Assay description: Activation of wild-type human presenilin-1 stably overexpressed in CHO cells co-expressing wild-type human amyloid precursor protein assessed as amyl...
In DepthDetails ArticlePubMed