BDBM50062732 CHEMBL3397718
SMILES CCCC\C(=C/c1cc(OCc2cccnc2)ccc1OCc1ccc(cc1)C(F)(F)F)C(O)=O
InChI Key InChIKey=YOUIPMNBJFZTSO-KGENOOAVSA-N
Data  2 IC50  2 EC50
  Tab Delimited (TSV)   2D SDfile   Computed 3D by Vconf -m prep SDfile
Find this compound or compounds like it in BindingDB:
Activity Spreadsheet -- Enzyme Inhibition Constant Data from BindingDB
Found 4 hits for monomerid = 50062732
TargetPolyunsaturated fatty acid 5-lipoxygenase(Homo sapiens (Human))
Goethe-University Frankfurt
Curated by ChEMBL
LigandPNGBDBM50062732(CHEMBL3397718)
Affinity DataIC50:  2.30E+3nM. Assay description: Inhibition of 5-LO in human human PMNL assessed as reduction in 5-LO product formation pre-incubated for 15 mins before addition of arachidonic acid ...
In DepthDetails ArticlePubMed
TargetPeroxisome proliferator-activated receptor gamma(Homo sapiens (Human))
Goethe-University Frankfurt
Curated by ChEMBL
LigandPNGBDBM50062732(CHEMBL3397718)
Affinity DataEC50:  2.56E+3nM. Assay description: Activation of human PPARgamma ligand binding domain expressed in COS7 cells by dual luciferase reporter gene assay
In DepthDetails ArticlePubMed
TargetPresenilin-1(Homo sapiens (Human))
Goethe-University Frankfurt
Curated by ChEMBL
LigandPNGBDBM50062732(CHEMBL3397718)
Affinity DataIC50:  3.21E+4nM. Assay description: Inhibition of wild-type human presenilin-1 stably overexpressed in CHO cells co-expressing wild-type human amyloid precursor protein assessed as inhi...
In DepthDetails ArticlePubMed
TargetPresenilin-1(Homo sapiens (Human))
Goethe-University Frankfurt
Curated by ChEMBL
LigandPNGBDBM50062732(CHEMBL3397718)
Affinity DataEC50:  2.32E+4nM. Assay description: Activation of wild-type human presenilin-1 stably overexpressed in CHO cells co-expressing wild-type human amyloid precursor protein assessed as amyl...
In DepthDetails ArticlePubMed