BDBM50062900 CHEMBL153890::[8-(2,6-Dichloro-benzyloxy)-2-methyl-imidazo[1,2-a]pyridin-3-yl]-methanol
SMILES Cc1nc2c(OCc3c(Cl)cccc3Cl)cccn2c1CO
InChI Key InChIKey=CGDQJCQNOSHQMN-UHFFFAOYSA-N
Data  1 IC50
  Tab Delimited (TSV)   2D SDfile   Computed 3D by Vconf -m prep SDfile
Find this compound or compounds like it in BindingDB:
Activity Spreadsheet -- Enzyme Inhibition Constant Data from BindingDB
Found 1 hit for monomerid = 50062900
TargetB2 bradykinin receptor(Cavia porcellus)
Fujisawa Pharmaceutical
Curated by ChEMBL
LigandPNGBDBM50062900(CHEMBL153890 | [8-(2,6-Dichloro-benzyloxy)-2-methy...)
Affinity DataIC50:  7.50E+3nM. Assay description: In vitro for inhibition of specific binding of [3H]BK (0.06 nM) to bradykinin receptor B2 in guinea pig ileum membrane preparations.
In DepthDetails ArticlePubMed