BDBM50063115 6,7,7,8,8-Pentamethyl-4-trifluoromethyl-6,7,8,9-tetrahydro-1H-pyrido[3,2-g]quinolin-2-one::CHEMBL157344
SMILES CC1c2cc3c(cc(=O)[nH]c3cc2NC(C)(C)C1(C)C)C(F)(F)F
InChI Key InChIKey=RJAYIUMTPVLORX-UHFFFAOYSA-N
Data  1 KI  2 IC50
  Tab Delimited (TSV)   2D SDfile   Computed 3D by Vconf -m prep SDfile
Find this compound or compounds like it in BindingDB:
Activity Spreadsheet -- Enzyme Inhibition Constant Data from BindingDB
Found 3 hits for monomerid = 50063115
TargetAndrogen receptor(Homo sapiens (Human))
Ligand Pharmaceuticals
Curated by ChEMBL
LigandPNGBDBM50063115(6,7,7,8,8-Pentamethyl-4-trifluoromethyl-6,7,8,9-te...)
Affinity DataKi:  358nM. Assay description: Binding affinity for human androgen receptor in transiently-transfected COS-1 cells.
In DepthDetails ArticlePubMed
TargetAndrogen receptor(Homo sapiens (Human))
Ligand Pharmaceuticals
Curated by ChEMBL
LigandPNGBDBM50063115(6,7,7,8,8-Pentamethyl-4-trifluoromethyl-6,7,8,9-te...)
Affinity DataIC50:  57nM. Assay description: Antagonistic activity against human androgen receptor (hAR) in co-transfected CV-1 cells.
In DepthDetails ArticlePubMed
TargetProgesterone receptor(Homo sapiens (Human))
Ligand Pharmaceuticals
Curated by ChEMBL
LigandPNGBDBM50063115(6,7,7,8,8-Pentamethyl-4-trifluoromethyl-6,7,8,9-te...)
Affinity DataIC50:  362nM. Assay description: Antagonistic activity against human progesterone receptor B (hPR-B) in co-transfected CV-1 cells.
In DepthDetails ArticlePubMed