BDBM50063197 CHEMBL158423::[3-(2-Chloro-benzyl)-3H-[1,2,3]triazolo[4,5-d]pyrimidin-7-yl]-m-tolyl-amine
SMILES Cc1cccc(Nc2ncnc3n(Cc4ccccc4Cl)nnc23)c1
InChI Key InChIKey=HHHAIUHWHXRELJ-UHFFFAOYSA-N
Data  1 KI
  Tab Delimited (TSV)   2D SDfile   Computed 3D by Vconf -m prep SDfile
Find this compound or compounds like it in BindingDB:
Activity Spreadsheet -- Enzyme Inhibition Constant Data from BindingDB
Found 1 hit for monomerid = 50063197
TargetAdenosine receptor A1(BOVINE)
Università
Curated by ChEMBL
LigandPNGBDBM50063197(CHEMBL158423 | [3-(2-Chloro-benzyl)-3H-[1,2,3]tria...)
Affinity DataKi:  5.88E+3nM. Assay description: Compound was tested for binding affinity at Adenosine A1 receptor in bovine brain cortical membranes using [3H]-(R)-(-)-N6-(2-phenylisopropyl)adenosi...
In DepthDetails ArticlePubMed