BDBM50063297 CHEMBL166252::Pyrimidin-2-yl-{4-[2-(4-thiazol-2-yl-piperazin-1-yl)-ethyl]-cyclohexyl}-amine
SMILES C(CN1CCN(CC1)c1nccs1)[C@H]1CC[C@@H](CC1)Nc1ncccn1
InChI Key InChIKey=MTQWOJOFKUQLJW-QAQDUYKDSA-N
Data  2 KI
  Tab Delimited (TSV)   2D SDfile   Computed 3D by Vconf -m prep SDfile
Find this compound or compounds like it in BindingDB:
Activity Spreadsheet -- Enzyme Inhibition Constant Data from BindingDB
Found 2 hits for monomerid = 50063297
Target5-hydroxytryptamine receptor 1A(Rattus norvegicus (rat))
Warner-Lambert
Curated by ChEMBL
LigandPNGBDBM50063297(CHEMBL166252 | Pyrimidin-2-yl-{4-[2-(4-thiazol-2-y...)
Affinity DataKi:  10nM. Assay description: The binding affinity of the compound was determined by measuring its ability to displace [3H]-8-OH-DPAT radioligand in 5-hydroxytryptamine 1A recepto...
In DepthDetails ArticlePubMed
TargetD(2) dopamine receptor(Homo sapiens (Human))
Warner-Lambert
Curated by ChEMBL
LigandPNGBDBM50063297(CHEMBL166252 | Pyrimidin-2-yl-{4-[2-(4-thiazol-2-y...)
Affinity DataKi:  46nM. Assay description: Binding affinity determined by measuring its ability to displace [3H]-N-0437 radioligand in CHO-K1 cells on Cloned Human Dopamine receptor D2
In DepthDetails ArticlePubMed