BDBM50063690 CHEMBL3397336
SMILES CC(C)c1cc(Cn2ccc3cc(OCC(O)=O)cc(C)c23)ccc1O
InChI Key InChIKey=FFXFRSBACWMSRN-UHFFFAOYSA-N
Data  2 KI
  Tab Delimited (TSV)   2D SDfile   Computed 3D by Vconf -m prep SDfile
Find this compound or compounds like it in BindingDB:
Activity Spreadsheet -- Enzyme Inhibition Constant Data from BindingDB
Found 2 hits for monomerid = 50063690
TargetThyroid hormone receptor beta(Homo sapiens (Human))
Eli Lilly
Curated by ChEMBL
LigandPNGBDBM50063690(CHEMBL3397336)
Affinity DataKi:  0.260nM. Assay description: Displacement of [125I]-L-3,5,3'-triiodothyronine from human TRbeta expressed in human Hela cell lysate measured after overnight incubation by competi...
In DepthDetails ArticlePubMed
TargetThyroid hormone receptor alpha(Homo sapiens (Human))
Eli Lilly
Curated by ChEMBL
LigandPNGBDBM50063690(CHEMBL3397336)
Affinity DataKi:  1.10nM. Assay description: Displacement of [125I]-L-3,5,3'-triiodothyronine from human TRalpha expressed in human Hela cell lysate measured after overnight incubation by compet...
In DepthDetails ArticlePubMed