BDBM50063829 CHEMBL406260::H-Phe-cyclo[DCys-Pal-DTrp-Lys-Val-Cys]-Nal-NH2
SMILES CC(C)[C@@H]1NC(=O)[C@@H](CCCCN)NC(=O)[C@H](Cc2c[nH]c3ccccc23)NC(=O)[C@@H](Cc2cccnc2)NC(=O)[C@@H](CSSC[C@H](NC1=O)C(=O)N[C@@H](Cc1ccc2ccccc2c1)C(N)=O)NC(=O)[C@@H](N)Cc1ccccc1
InChI Key InChIKey=AXVKTGVAIQSFOE-LOHZWWSOSA-N
Data  5 IC50
  Tab Delimited (TSV)   2D SDfile   Computed 3D by Vconf -m prep SDfile
Find this compound or compounds like it in BindingDB:
Activity Spreadsheet -- Enzyme Inhibition Constant Data from BindingDB
Found 5 hits for monomerid = 50063829
TargetSomatostatin receptor type 4(Homo sapiens (Human))
Tulane University School Of Medicine
Curated by ChEMBL
LigandPNGBDBM50063829(CHEMBL406260 | H-Phe-cyclo[DCys-Pal-DTrp-Lys-Val-C...)
Affinity DataIC50:  1.00E+3nM. Assay description: Binding affinity towards cloned human somatostatin 4 (hsst) receptor
In DepthDetails ArticlePubMed
TargetSomatostatin receptor type 1(Homo sapiens (Human))
Tulane University School Of Medicine
Curated by ChEMBL
LigandPNGBDBM50063829(CHEMBL406260 | H-Phe-cyclo[DCys-Pal-DTrp-Lys-Val-C...)
Affinity DataIC50:  535nM. Assay description: Binding affinity towards cloned human somatostatin 1 (hsst) receptor
In DepthDetails ArticlePubMed
TargetSomatostatin receptor type 2(Homo sapiens (Human))
Tulane University School Of Medicine
Curated by ChEMBL
LigandPNGBDBM50063829(CHEMBL406260 | H-Phe-cyclo[DCys-Pal-DTrp-Lys-Val-C...)
Affinity DataIC50:  123nM. Assay description: Binding affinity towards cloned human somatostatin 2 (hsst) receptor
In DepthDetails ArticlePubMed
TargetSomatostatin receptor type 5(Homo sapiens (Human))
Tulane University School Of Medicine
Curated by ChEMBL
LigandPNGBDBM50063829(CHEMBL406260 | H-Phe-cyclo[DCys-Pal-DTrp-Lys-Val-C...)
Affinity DataIC50:  769nM. Assay description: Binding affinity towards cloned human somatostatin 5 (hsst) receptor
In DepthDetails ArticlePubMed
TargetSomatostatin receptor type 3(Homo sapiens (Human))
Tulane University School Of Medicine
Curated by ChEMBL
LigandPNGBDBM50063829(CHEMBL406260 | H-Phe-cyclo[DCys-Pal-DTrp-Lys-Val-C...)
Affinity DataIC50:  373nM. Assay description: Binding affinity towards cloned human somatostatin 3 (hsst) receptor
In DepthDetails ArticlePubMed