BDBM50064205 CHEMBL42117::Dicyclopropyl-methanone O-[3-(4-tert-butyl-phenylamino)-2-hydroxy-propyl]-oxime
SMILES CC(C)(C)c1ccc(NCC(O)CON=C(C2CC2)C2CC2)cc1
InChI Key InChIKey=BZZGFQBQMDECGA-UHFFFAOYSA-N
Data  1 IC50
  Tab Delimited (TSV)   2D SDfile   Computed 3D by Vconf -m prep SDfile
Find this compound or compounds like it in BindingDB:
Activity Spreadsheet -- Enzyme Inhibition Constant Data from BindingDB
Found 1 hit for monomerid = 50064205
TargetBeta-2 adrenergic receptor(Canis familiaris)
University Of Grenoble
Curated by ChEMBL
LigandPNGBDBM50064205(CHEMBL42117 | Dicyclopropyl-methanone O-[3-(4-tert...)
Affinity DataIC50: >1.00E+4nM. Assay description: Inhibition of beta-2 adrenergic receptor isolated from rat lung homogenates
In DepthDetails ArticlePubMed