BDBM50064386 CHEMBL3403699
SMILES CCCc1cc2c(cc(=O)oc2c(CCC)c1OCCCCN1C(=O)NC(C)(C1=O)c1ccc(OC)cc1)C(F)(F)F
InChI Key InChIKey=NKVYSNNVQZTVMZ-UHFFFAOYSA-N
Data  1 EC50
  Tab Delimited (TSV)   2D SDfile   Computed 3D by Vconf -m prep SDfile
Find this compound or compounds like it in BindingDB:
Activity Spreadsheet -- Enzyme Inhibition Constant Data from BindingDB
Found 1 hit for monomerid = 50064386
TargetOxysterols receptor LXR-beta(Homo sapiens (Human))
Kowa
Curated by ChEMBL
LigandPNGBDBM50064386(CHEMBL3403699)
Affinity DataEC50:  960nM. Assay description: Agonist activity at Gal4-tagged LXRbeta (unknown origin) expressed in CHOK1 cells after 24 hrs by luciferase reporter gene assay
In DepthDetails ArticlePubMed