BDBM50064462 8-(Morpholin-2-ylmethoxy)-2H-chromene-3-carbonitrile::CHEMBL57423
SMILES N#CC1=Cc2cccc(OCC3CNCCO3)c2OC1
InChI Key InChIKey=YPZUBLHVIMPGGR-UHFFFAOYSA-N
Data  1 KI
  Tab Delimited (TSV)   2D SDfile   Computed 3D by Vconf -m prep SDfile
Find this compound or compounds like it in BindingDB:
Activity Spreadsheet -- Enzyme Inhibition Constant Data from BindingDB
Found 1 hit for monomerid = 50064462
Target5-hydroxytryptamine receptor 1B(Rattus norvegicus (Rat))
Astra Arcus
Curated by ChEMBL
LigandPNGBDBM50064462(8-(Morpholin-2-ylmethoxy)-2H-chromene-3-carbonitri...)
Affinity DataKi:  250nM. Assay description: Binding affinity against 5-hydroxytryptamine 1B receptor in membranes of Rat cerebral cortex
In DepthDetails ArticlePubMed