BDBM50064573 6-{2-[4-(3-Trifluoromethyl-phenyl)-piperazin-1-yl]-ethyl}-3H-benzothiazol-2-one::CHEMBL59741
SMILES FC(F)(F)c1cccc(c1)N1CCN(CCc2ccc3[nH]c(=O)sc3c2)CC1
InChI Key InChIKey=DZKFKYARPPSLED-UHFFFAOYSA-N
Data  6 IC50
  Tab Delimited (TSV)   2D SDfile   Computed 3D by Vconf -m prep SDfile
Find this compound or compounds like it in BindingDB:
Activity Spreadsheet -- Enzyme Inhibition Constant Data from BindingDB
Found 6 hits for monomerid = 50064573
Target5-hydroxytryptamine receptor 1A(Homo sapiens (Human))
Institut De Chimie Pharmaceutique Albert Lespagnol
Curated by ChEMBL
LigandPNGBDBM50064573(6-{2-[4-(3-Trifluoromethyl-phenyl)-piperazin-1-yl]...)
Affinity DataIC50:  3.00E+3nM. Assay description: Affinity towards 5-hydroxytryptamine 1A receptor in membranes from bovine hippocampus using [3H]-OH-DPAT
In DepthDetails ArticlePubMed
Target5-hydroxytryptamine receptor 1B(Rattus norvegicus (Rat))
Institut De Chimie Pharmaceutique Albert Lespagnol
Curated by ChEMBL
LigandPNGBDBM50064573(6-{2-[4-(3-Trifluoromethyl-phenyl)-piperazin-1-yl]...)
Affinity DataIC50:  600nM. Assay description: Affinity towards 5-hydroxytryptamine 1B receptor in membranes from rat frontal cortex using [3H]-5-HT
In DepthDetails ArticlePubMed
TargetD(2) dopamine receptor(BOVINE)
Institut De Chimie Pharmaceutique Albert Lespagnol
Curated by ChEMBL
LigandPNGBDBM50064573(6-{2-[4-(3-Trifluoromethyl-phenyl)-piperazin-1-yl]...)
Affinity DataIC50:  60nM. Assay description: Affinity towards Dopamine receptor D2 in membranes from bovine striatum using [3H]-raclopride
In DepthDetails ArticlePubMed
Target5-hydroxytryptamine receptor 2C(Homo sapiens (Human))
Institut De Chimie Pharmaceutique Albert Lespagnol
Curated by ChEMBL
LigandPNGBDBM50064573(6-{2-[4-(3-Trifluoromethyl-phenyl)-piperazin-1-yl]...)
Affinity DataIC50:  60nM. Assay description: Affinity towards 5-hydroxytryptamine 2C receptor in membranes from pig choroid plexus using [3H]-N-methyl-mesulergine
In DepthDetails ArticlePubMed
Target5-hydroxytryptamine receptor 2A(BOVINE)
Institut De Chimie Pharmaceutique Albert Lespagnol
Curated by ChEMBL
LigandPNGBDBM50064573(6-{2-[4-(3-Trifluoromethyl-phenyl)-piperazin-1-yl]...)
Affinity DataIC50:  200nM. Assay description: Affinity towards 5-hydroxytryptamine 2A receptor in membranes from bovine frontal cortex using [3H]-Ketanserin
In DepthDetails ArticlePubMed
TargetAlpha-1A adrenergic receptor(CALF)
Institut De Chimie Pharmaceutique Albert Lespagnol
Curated by ChEMBL
LigandPNGBDBM50064573(6-{2-[4-(3-Trifluoromethyl-phenyl)-piperazin-1-yl]...)
Affinity DataIC50:  90nM. Assay description: Affinity towards Alpha-1A adrenergic receptor in membranes from bovine frontal cortex using [3H]-prazosin
In DepthDetails ArticlePubMed