BDBM50064625 CHEMBL3403733
SMILES CN(C)c1nc(Nc2ccc(C)cc2)sc1C(=O)Nc1sc2CCCCc2c1C(N)=O
InChI Key InChIKey=MEMQHGHFQKPZOS-UHFFFAOYSA-N
Data  3 KI
  Tab Delimited (TSV)   2D SDfile   Computed 3D by Vconf -m prep SDfile
Find this compound or compounds like it in BindingDB:
Activity Spreadsheet -- Enzyme Inhibition Constant Data from BindingDB
Found 3 hits for monomerid = 50064625
TargetAdenosine receptor A3(Homo sapiens (Human))
B. V. Patel Pharmaceutical Education And Research Development (Perd) Centre
Curated by ChEMBL
LigandPNGBDBM50064625(CHEMBL3403733)
Affinity DataKi:  7.13E+3nM. Assay description: Displacement of [3H]HEMADO from human adenosine A3 receptor expressed in CHO cells
In DepthDetails ArticlePubMed
TargetAdenosine receptor A2a(Homo sapiens (Human))
B. V. Patel Pharmaceutical Education And Research Development (Perd) Centre
Curated by ChEMBL
LigandPNGBDBM50064625(CHEMBL3403733)
Affinity DataKi:  2.23E+4nM. Assay description: Displacement of [3H]NECA from human adenosine A2A receptor expressed in CHO cells
In DepthDetails ArticlePubMed
TargetAdenosine receptor A1(Homo sapiens (Human))
B. V. Patel Pharmaceutical Education And Research Development (Perd) Centre
Curated by ChEMBL
LigandPNGBDBM50064625(CHEMBL3403733)
Affinity DataKi:  3.24E+4nM. Assay description: Displacement of [3H]CCPA from human adenosine A1 receptor expressed in CHO cells
In DepthDetails ArticlePubMed