BDBM50064649 CHEMBL3403772
SMILES CCCC(C)COc1ccc(cc1)[C@H](CO)NC(=O)[C@H](C)c1ccccc1
InChI Key InChIKey=GXJPLTPOMVKXAT-CZCIXBEGSA-N
Data  1 EC50
  Tab Delimited (TSV)   2D SDfile   Computed 3D by Vconf -m prep SDfile
Find this compound or compounds like it in BindingDB:
Activity Spreadsheet -- Enzyme Inhibition Constant Data from BindingDB
Found 1 hit for monomerid = 50064649
TargetProbable G-protein coupled receptor 88(Homo sapiens (Human))
Bristol-Myers Squibb
Curated by ChEMBL
LigandPNGBDBM50064649(CHEMBL3403772)
Affinity DataEC50:  110nM. Assay description: Agonist activity at GPR88 (unknown origin) transfected in forskolin-stimulated HEK cells assessed as inhibition of cAMP production after 30 mins by H...
In DepthDetails ArticlePubMed