BDBM50064723 1-(1-{2-Methoxy-4-[1-(1-oxy-5,6,7,8-tetrahydro-quinolin-5-yl)-piperidin-4-yloxy]-benzoyl}-piperidin-4-yl)-1,4-dihydro-benzo[d][1,3]oxazin-2-one::CHEMBL69201
SMILES COc1cc(OC2CCN(CC2)C2CCCc3c2ccc[n+]3[O-])ccc1C(=O)N1CCC(CC1)N1C(=O)OCc2ccccc12
InChI Key InChIKey=GRKWMUZMGMYCOJ-UHFFFAOYSA-N
Data  2 KI
  Tab Delimited (TSV)   2D SDfile   Computed 3D by Vconf -m prep SDfile
Find this compound or compounds like it in BindingDB:
Activity Spreadsheet -- Enzyme Inhibition Constant Data from BindingDB
Found 2 hits for monomerid = 50064723
TargetOxytocin receptor(Homo sapiens (Human))
Merck Research Laboratories
Curated by ChEMBL
LigandPNGBDBM50064723(1-(1-{2-Methoxy-4-[1-(1-oxy-5,6,7,8-tetrahydro-qui...)
Affinity DataKi:  7nM. Assay description: Binding affinity for cloned human oxytocin receptor (OT-R)
In DepthDetails ArticlePubMed
TargetOxytocin receptor(RAT)
Merck Research Laboratories
Curated by ChEMBL
LigandPNGBDBM50064723(1-(1-{2-Methoxy-4-[1-(1-oxy-5,6,7,8-tetrahydro-qui...)
Affinity DataKi:  20nM. Assay description: Binding affinity for rat oxytocin receptor (OT-R)
In DepthDetails ArticlePubMed