BDBM50065024 CHEMBL3402667
SMILES Cl.CN(C)[C@H]1C[C@H](c2ccc(F)cc2)c2ccccc2C1
InChI Key InChIKey=IICRMIVKDQNPPS-PHJLCXHGSA-N
Data  4 KI
  Tab Delimited (TSV)   2D SDfile   Computed 3D by Vconf -m prep SDfile
Find this compound or compounds like it in BindingDB:
Activity Spreadsheet -- Enzyme Inhibition Constant Data from BindingDB
Found 4 hits for monomerid = 50065024
TargetHistamine H3 receptor(Homo sapiens (Human))
University Of Florida
Curated by ChEMBL
LigandPNGBDBM50065024(CHEMBL3402667)
Affinity DataKi:  4nM. Assay description: Binding affinity to human histamine H3 receptor expressed in HEK293 cells
In DepthDetails ArticlePubMed
Target5-hydroxytryptamine receptor 2C(Homo sapiens (Human))
University Of Florida
Curated by ChEMBL
LigandPNGBDBM50065024(CHEMBL3402667)
Affinity DataKi:  68nM. Assay description: Displacement of [3H]Mesulergine from human 5-HT2C-INI receptor expressed in HEK293 cells by scintillation counting analysis
In DepthDetails ArticlePubMed
Target5-hydroxytryptamine receptor 2A(Homo sapiens (Human))
University Of Florida
Curated by ChEMBL
LigandPNGBDBM50065024(CHEMBL3402667)
Affinity DataKi:  140nM. Assay description: Displacement of [3H]Ketanserin from human 5-HT2A receptor expressed in HEK293 cells by scintillation counting analysis
In DepthDetails ArticlePubMed
Target5-hydroxytryptamine receptor 2B(Homo sapiens (Human))
University Of Florida
Curated by ChEMBL
LigandPNGBDBM50065024(CHEMBL3402667)
Affinity DataKi:  400nM. Assay description: Displacement of [3H]Mesulergine from human 5-HT2B receptor expressed in HEK293 cells by scintillation counting analysis
In DepthDetails ArticlePubMed