BDBM50065062 3-[(4R,5S,6S,7R)-4,7-Dibenzyl-5,6-dihydroxy-3-(1H-indazol-5-ylmethyl)-2-oxo-[1,3]diazepan-1-ylmethyl]-N-pyridin-2-yl-benzamide::CHEMBL82363
SMILES O[C@@H]1[C@@H](O)[C@@H](Cc2ccccc2)N(Cc2ccc3[nH]ncc3c2)C(=O)N(Cc2cccc(c2)C(=O)Nc2ccccn2)[C@@H]1Cc1ccccc1
InChI Key InChIKey=MYLPKRNDNXIKCB-PASMDFPHSA-N
Data  1 KI
  Tab Delimited (TSV)   2D SDfile   Computed 3D by Vconf -m prep SDfile
Find this compound or compounds like it in BindingDB:
Activity Spreadsheet -- Enzyme Inhibition Constant Data from BindingDB
Found 1 hit for monomerid = 50065062
TargetGag-Pol polyprotein [489-587](Human immunodeficiency virus type 1)
Dupont Pharmaceuticals
Curated by ChEMBL
LigandPNGBDBM50065062(3-[(4R,5S,6S,7R)-4,7-Dibenzyl-5,6-dihydroxy-3-(1H-...)
Affinity DataKi:  0.0510nM. Assay description: Inhibitory activity against HIV protease
In DepthDetails ArticlePubMed