BDBM50065132 CHEMBL420216::N-[4-(5H,11H-Benzo[e]pyrrolo[1,2-a][1,4]diazepine-10-carbonyl)-3-chloro-phenyl]-2,5-dimethyl-benzamide
SMILES Cc1ccc(C)c(c1)C(=O)Nc1ccc(C(=O)N2Cc3cccn3Cc3ccccc23)c(Cl)c1
InChI Key InChIKey=XKQPFXGJKICVEM-UHFFFAOYSA-N
Data  2 IC50
  Tab Delimited (TSV)   2D SDfile   Computed 3D by Vconf -m prep SDfile
Find this compound or compounds like it in BindingDB:
Activity Spreadsheet -- Enzyme Inhibition Constant Data from BindingDB
Found 2 hits for monomerid = 50065132
TargetVasopressin V2 receptor(Homo sapiens (Human))
Wyeth-Ayerst Research
Curated by ChEMBL
LigandPNGBDBM50065132(CHEMBL420216 | N-[4-(5H,11H-Benzo[e]pyrrolo[1,2-a]...)
Affinity DataIC50:  4.20nM. Assay description: Displacement of [3H]-AVP from human V2 receptor expressed in murine fibroblast cell line (LV2) membranes
In DepthDetails ArticlePubMed
TargetVasopressin V1a receptor(Homo sapiens (Human))
Wyeth-Ayerst Research
Curated by ChEMBL
LigandPNGBDBM50065132(CHEMBL420216 | N-[4-(5H,11H-Benzo[e]pyrrolo[1,2-a]...)
Affinity DataIC50:  340nM. Assay description: Displacement of [3H]-AVP from vasopressin receptor (V1a) from human platelet membranes.
In DepthDetails ArticlePubMed