BDBM50065305 3-[1-(4-Bromo-phenyl)-meth-(Z)-ylidene]-1,3-dihydro-indol-2-one::CHEMBL86837
SMILES Brc1ccc(\C=C2/C(=O)Nc3ccccc23)cc1
InChI Key InChIKey=INAOSTJXLBNFMV-LCYFTJDESA-N
Data  6 IC50
  Tab Delimited (TSV)   2D SDfile   Computed 3D by Vconf -m prep SDfile
Find this compound or compounds like it in BindingDB:
Activity Spreadsheet -- Enzyme Inhibition Constant Data from BindingDB
Found 6 hits for monomerid = 50065305
TargetPlatelet-derived growth factor receptor beta(Homo sapiens (Human))
Sugen
Curated by ChEMBL
LigandPNGBDBM50065305(3-[1-(4-Bromo-phenyl)-meth-(Z)-ylidene]-1,3-dihydr...)
Affinity DataIC50: >1.00E+5nM. Assay description: Test concentration required to achieve 50% inhibition of tyrosine phosphorylation on human Platelet-derived growth factor receptor beta (PDGF RTK).
In DepthDetails ArticlePubMed
TargetInsulin-like growth factor 1 receptor(Homo sapiens (Human))
Sugen
Curated by ChEMBL
LigandPNGBDBM50065305(3-[1-(4-Bromo-phenyl)-meth-(Z)-ylidene]-1,3-dihydr...)
Affinity DataIC50: >1.00E+5nM. Assay description: Concentration required to achieve 50% inhibition of tyrosine phosphorylation on human Insulin-like growth factor I receptor
In DepthDetails ArticlePubMed
TargetAmine oxidase [flavin-containing] A(Bos taurus)
Manipal College Of Pharmaceutical Sciences
Curated by ChEMBL
LigandPNGBDBM50065305(3-[1-(4-Bromo-phenyl)-meth-(Z)-ylidene]-1,3-dihydr...)
Affinity DataIC50:  1.82E+4nM. Assay description: Inhibition of MAO-A in bovine brain mitochondria using serotonin as substrate preincubated for 30 mins measured after 30 mins by spectrofluorimetric ...
In DepthDetails ArticlePubMed
TargetReceptor tyrosine-protein kinase erbB-2(Homo sapiens (Human))
Sugen
Curated by ChEMBL
LigandPNGBDBM50065305(3-[1-(4-Bromo-phenyl)-meth-(Z)-ylidene]-1,3-dihydr...)
Affinity DataIC50: >1.00E+5nM. Assay description: Concentration required to achieve 50% inhibition of tyrosine phosphorylation on human Her-2 receptor tyrosine kinase (HER-2 RTK)
In DepthDetails ArticlePubMed
TargetEpidermal growth factor receptor(Homo sapiens (Human))
Sugen
Curated by ChEMBL
LigandPNGBDBM50065305(3-[1-(4-Bromo-phenyl)-meth-(Z)-ylidene]-1,3-dihydr...)
Affinity DataIC50: >1.00E+5nM. Assay description: Concentration required to achieve 50% inhibition of tyrosine phosphorylation on human Epidermal growth factor receptor (EGF RTK).
In DepthDetails ArticlePubMed
TargetVascular endothelial growth factor receptor 1(Mus musculus)
Sugen
Curated by ChEMBL
LigandPNGBDBM50065305(3-[1-(4-Bromo-phenyl)-meth-(Z)-ylidene]-1,3-dihydr...)
Affinity DataIC50: >1.00E+5nM. Assay description: Concentration required to achieve 50% inhibition of tyrosine phosphorylation on murine VEGF receptor (FLK-1 RTK).
In DepthDetails ArticlePubMed