BDBM50065307 5-Chloro-3-(4-hydroxy-3,5-diisopropyl-benzylidene)-1,3-dihydro-indol-2-one::5-Chloro-3-[1-(4-hydroxy-3,5-diisopropyl-phenyl)-meth-(Z)-ylidene]-1,3-dihydro-indol-2-one::CHEMBL89723
SMILES CC(C)c1cc(\C=C2/C(=O)Nc3ccc(Cl)cc23)cc(C(C)C)c1O
InChI Key InChIKey=OHYZPHUXMLDXTQ-NVMNQCDNSA-N
Data  6 IC50
  Tab Delimited (TSV)   2D SDfile   Computed 3D by Vconf -m prep SDfile
Find this compound or compounds like it in BindingDB:
Activity Spreadsheet -- Enzyme Inhibition Constant Data from BindingDB
Found 6 hits for monomerid = 50065307
TargetVascular endothelial growth factor receptor 2(Mus musculus)
Eli Lilly
Curated by ChEMBL
LigandPNGBDBM50065307(5-Chloro-3-(4-hydroxy-3,5-diisopropyl-benzylidene)...)
Affinity DataIC50:  4.27E+3nM. Assay description: Inhibitory activity against vascular endothelial growth factor receptor 2 (FLK1)
In DepthDetails ArticlePubMed
TargetEpidermal growth factor receptor(Homo sapiens (Human))
Sugen
Curated by ChEMBL
LigandPNGBDBM50065307(5-Chloro-3-(4-hydroxy-3,5-diisopropyl-benzylidene)...)
Affinity DataIC50:  9.50E+3nM. Assay description: Concentration required to achieve 50% inhibition of tyrosine phosphorylation on human Epidermal growth factor receptor (EGF RTK).
In DepthDetails ArticlePubMed
TargetPlatelet-derived growth factor receptor beta(Homo sapiens (Human))
Sugen
Curated by ChEMBL
LigandPNGBDBM50065307(5-Chloro-3-(4-hydroxy-3,5-diisopropyl-benzylidene)...)
Affinity DataIC50:  6.04E+4nM. Assay description: Test concentration required to achieve 50% inhibition of tyrosine phosphorylation on human Platelet-derived growth factor receptor beta (PDGF RTK).
In DepthDetails ArticlePubMed
TargetVascular endothelial growth factor receptor 1(Mus musculus)
Sugen
Curated by ChEMBL
LigandPNGBDBM50065307(5-Chloro-3-(4-hydroxy-3,5-diisopropyl-benzylidene)...)
Affinity DataIC50:  4.30E+3nM. Assay description: Concentration required to achieve 50% inhibition of tyrosine phosphorylation on murine VEGF receptor (FLK-1 RTK).
In DepthDetails ArticlePubMed
TargetReceptor tyrosine-protein kinase erbB-2(Homo sapiens (Human))
Sugen
Curated by ChEMBL
LigandPNGBDBM50065307(5-Chloro-3-(4-hydroxy-3,5-diisopropyl-benzylidene)...)
Affinity DataIC50:  8.20E+3nM. Assay description: Concentration required to achieve 50% inhibition of tyrosine phosphorylation on human Her-2 receptor tyrosine kinase (HER-2 RTK)
In DepthDetails ArticlePubMed
TargetInsulin-like growth factor 1 receptor(Homo sapiens (Human))
Sugen
Curated by ChEMBL
LigandPNGBDBM50065307(5-Chloro-3-(4-hydroxy-3,5-diisopropyl-benzylidene)...)
Affinity DataIC50: >1.00E+5nM. Assay description: Concentration required to achieve 50% inhibition of tyrosine phosphorylation on human Insulin-like growth factor I receptor
In DepthDetails ArticlePubMed