BDBM50065391 CHEMBL3401342
SMILES CC(C)[C@]1(C)CC(=O)N(Cc2cccc(c2)N2C[C@H](CC2=O)c2ccccc2)C(=N)N1
InChI Key InChIKey=VBYHYTJHKFQNCE-CPJSRVTESA-N
Data  1 KI
PDB links: 1 PDB ID matches this monomer.
  Tab Delimited (TSV)   2D SDfile   Computed 3D by Vconf -m prep SDfile
Find this compound or compounds like it in BindingDB:
Activity Spreadsheet -- Enzyme Inhibition Constant Data from BindingDB
Found 1 hit for monomerid = 50065391
TargetRenin(Homo sapiens (Human))
Merck Research Laboratories
Curated by ChEMBL
LigandPNGBDBM50065391(CHEMBL3401342)
Affinity DataKi:  44nM. Assay description: Inhibition of renin (unknown origin)