BDBM50065474 2-(4-Chloro-phenoxymethyl)-7-methyl-1-(3-piperidin-3-yl-propyl)-1H-benzoimidazole::CHEMBL329786
SMILES Cc1cccc2nc(COc3ccc(Cl)cc3)n(CCCC3CCCNC3)c12
InChI Key InChIKey=JYHSAWORPZWUIB-UHFFFAOYSA-N
Data  1 KI
  Tab Delimited (TSV)   2D SDfile   Computed 3D by Vconf -m prep SDfile
Find this compound or compounds like it in BindingDB:
Activity Spreadsheet -- Enzyme Inhibition Constant Data from BindingDB
Found 1 hit for monomerid = 50065474
TargetNeuropeptide Y receptor type 1(Homo sapiens (Human))
Eli Lilly
Curated by ChEMBL
LigandPNGBDBM50065474(2-(4-Chloro-phenoxymethyl)-7-methyl-1-(3-piperidin...)
Affinity DataKi:  400nM. Assay description: In vitro binding affinity towards human neuropeptide Y receptor type 1, determined by measuring its ability to displace [125]peptide YY
In DepthDetails ArticlePubMed