BDBM50065770 CHEMBL3404056
SMILES N[C@H](CN(C(=O)[C@@H]1C[C@H]1c1ccccc1)c1ccc(cc1)-c1ccccc1)C1CCCCC1
InChI Key InChIKey=WRFDSTMXFPTYPP-ZGIBFIJWSA-N
Data  1 EC50
  Tab Delimited (TSV)   2D SDfile   Computed 3D by Vconf -m prep SDfile
Find this compound or compounds like it in BindingDB:
Activity Spreadsheet -- Enzyme Inhibition Constant Data from BindingDB
Found 1 hit for monomerid = 50065770
TargetProbable G-protein coupled receptor 88(Homo sapiens (Human))
Lexicon Pharmaceuticals
Curated by ChEMBL
LigandPNGBDBM50065770(CHEMBL3404056)
Affinity DataEC50:  0.660nM. Assay description: Agonist activity at GPR88 (unknown origin) transfected into cells assessed as cAMP accumulation by HTRF assay
In DepthDetails ArticlePubMed